BDBM50053900 Allyl-(9-allyl-2-{4-[(10,11-dihydro-5H-dibenzo[a,d]cyclohepten-10-ylmethyl)-amino]-piperidin-1-yl}-9H-purin-6-yl)-amine::CHEMBL341462
SMILES C=CCNc1nc(nc2n(CC=C)cnc12)N1CCC(CC1)NCC1Cc2ccccc2Cc2ccccc12
InChI Key InChIKey=JKCIMYUANKCSAN-UHFFFAOYSA-N
Data  1 KI
  Tab Delimited (TSV)   2D SDfile   Computed 3D by Vconf -m prep SDfile
Find this compound or compounds like it in BindingDB:
Activity Spreadsheet -- Enzyme Inhibition Constant Data from BindingDB
Found 1 hit for monomerid = 50053900
TargetVoltage-dependent L-type calcium channel subunit alpha-1S(Rattus norvegicus)
Institut De Recherches Servier
Curated by ChEMBL
LigandPNGBDBM50053900(Allyl-(9-allyl-2-{4-[(10,11-dihydro-5H-dibenzo[a,d...)
Affinity DataKi:  46nM. Assay description: Inhibition of [3H]-D-888 binding to L-type [Ca2+] channel of membranes from rat skeletal muscle
In DepthDetails ArticlePubMed